{"text_format":"1","workbook":"xlsx","n_sheets":6,"sheets":["事業実施計画書（記載方法）","交付申請書","事業実施計画書","申請概要","リスト","医療機関コードマスタ"],"not_rendered":{"charts":0,"images":1,"macros":1,"external_links":1,"defined_names":94,"comments":2,"pivot_tables":0},"unopened":[],"bounds":{"document_bytes":16777216,"sheet_cells":100000,"rows_first":2000,"rows_last":500,"rows_between":2000,"halvings":0,"cell_chars":16384,"cell_head_chars":4096},"cells_cut":0,"cells_raw":0,"read":"whole","date_system":"1900"}

{"sheet":"事業実施計画書（記載方法）","index":0,"n_rows":73,"n_cols":28,"rows_kept":73,"cut":false,"hidden":false,"merged":[[0,27,0,29],[2,15,2,29],[3,0,3,29],[5,0,5,2],[5,3,5,6],[7,0,7,29],[10,16,11,29],[13,0,14,2],[13,3,14,8],[13,9,14,11],[13,12,14,17],[16,0,17,2],[16,3,16,7],[16,8,16,12],[16,13,16,17],[16,18,16,29],[10,8,11,8],[10,9,11,9],[10,10,11,10],[10,11,11,11],[10,12,11,12],[10,13,11,15],[10,0,11,2],[10,3,11,3],[10,4,11,4],[10,5,11,5],[10,6,11,6],[10,7,11,7],[17,3,17,7],[17,8,17,12],[17,13,17,17],[17,18,17,29],[19,0,20,2],[19,3,19,10],[19,11,19,14],[19,15,19,26],[20,11,20,14],[20,15,20,26],[25,0,25,11],[25,12,25,13],[25,14,25,29],[27,0,27,29],[29,0,29,11],[29,12,29,13],[29,14,29,29],[22,0,22,5],[22,6,22,11],[22,12,22,14],[22,15,22,18],[22,19,22,23],[22,24,22,29],[31,0,31,13],[31,14,31,15],[31,16,31,29],[33,0,33,13],[33,14,33,15],[33,16,33,29],[35,28,36,28],[35,29,36,29],[35,27,36,27],[35,15,36,15],[35,16,36,16],[35,17,36,19],[35,20,36,23],[35,24,36,26],[34,0,34,10],[35,0,36,2],[35,3,36,9],[35,10,36,12],[35,13,36,13],[35,14,36,14],[43,0,43,29],[45,0,45,29],[47,0,47,19],[47,20,47,21],[47,22,47,29],[49,2,49,26],[37,27,38,27],[37,28,38,28],[37,29,38,29],[39,0,39,6],[39,7,39,29],[40,0,41,6],[40,7,41,29],[37,0,38,6],[37,7,38,12],[37,13,38,21],[37,22,38,22],[37,23,38,23],[37,24,38,24],[37,25,38,25],[37,26,38,26],[53,1,53,28],[55,4,55,16],[55,17,55,20],[55,21,55,24],[56,4,65,5],[56,6,56,16],[56,17,56,20],[56,21,65,24],[57,6,57,16],[57,17,57,20],[64,6,64,16],[64,17,64,20],[65,6,65,16],[65,17,65,20],[61,6,61,16],[61,17,61,20],[62,6,62,16],[62,17,62,20],[63,6,63,16],[63,17,63,20],[58,6,58,16],[58,17,58,20],[59,6,59,16],[59,17,59,20],[60,6,60,16],[60,17,60,20],[72,1,72,28],[66,21,66,24],[67,4,67,16],[67,17,67,24],[68,4,68,16],[68,17,68,24],[70,2,70,15],[70,16,70,17],[70,18,70,27],[66,4,66,5],[66,6,66,16],[66,17,66,20]]}
[null,null,null,null,null,null,null,null,null,null,null,null,null,null,null,null,null,null,null,null,null,null,null,null,null,null,null,"○○県"]
[]
["様式2-1 （「様式2-2」は、紙申請用であり、どちらか一方を提出）",null,null,null,null,null,null,null,null,null,null,null,null,null,null,"オンライン請求システム・WEB受付申請システム・電子媒体(CD-R）申請用"]
["事業実施計画書_医療機関・薬局等における感染拡大防止等支援事業"]
[]
["申請日",null,null,"2020-07-31"]
[]
["施設概要"]
[]
[null,null,"助産所コードを有さない助産所は「9999999999」を入力してください"]
["医療機関等\nコード（10桁）",null,null,1,3,3,4,5,6,7,8,9,0,"施設名称",null,null,"医療法人社団〇〇〇　△△△病院"]
[]
[]
["管理者職名",null,null,"病院長",null,null,null,null,null,"管理者氏名",null,null,"○○○○"]
[]
[]
["連絡先",null,null,"担当部署",null,null,null,null,"担当者氏名",null,null,null,null,"連絡先電話番号",null,null,null,null,"連絡先メールアドレス"]
[null,null,null,"○○部",null,null,null,null,"○○○○",null,null,null,null,"03-xxxx-xxxx",null,null,null,null,"○○○○@○○.○○"]
[]
["所在地",null,null,"郵便番号",null,null,null,null,null,null,null,"都道府県",null,null,null,"市区町村以降"]
[null,null,null,1,2,3,"-",4,5,6,7,"東京都",null,null,null,"中央区日本橋〇－〇－〇"]
[]
["施設類型（プルダウンから選択）",null,null,null,null,null,"病院",null,null,null,null,null,"許可病床数※\n（病院のみ記載）",null,null,300,null,null,null,"a_補助上限額（基準額）\n（円）",null,null,null,null,{"$f":"IF(G23=\"病院\",200+5*P23,IF(OR(G23=\"有床診療所（医科）\",G23=\"有床診療所（歯科）\"),200,IF(OR(G23=\"無床診療所（医科）\",G23=\"無床診療所（歯科）\"),100,IF(OR(G23=\"薬局\",G23=\"訪問看護ステーション\",G23=\"助産所\"),70,\"０\"))))*10000","v":17000000}]
[null,null,null,null,null,null,null,null,null,null,null,null,"※ 原則として令和２年4月1日現在の医療法上の許可病床数"]
[]
["施設類型及び許可病床数に間違いがない",null,null,null,null,null,null,null,null,null,null,null,"はい",null,"施設類型及び許可病床数に間違いがない場合は、左の欄で「はい」を選択して下さい。\n※間違いがあり本来の補助金額を超過して補助金が支払われた場合、超過分は返還対象となります。"]
[]
["口座情報"]
[]
["国保連合会に登録されている口座は債権譲渡されていない",null,null,null,null,null,null,null,null,null,null,null,"はい",null,"債権譲渡されていない場合は、「はい」を選択して下さい。債権譲渡されている場合は、国保連に登録されている口座への補助金の振込ができませんので、債権譲渡されていない口座の情報を提出していただく必要があります。"]
[]
["国保連合会による当該口座の債権譲渡に関する確認結果が都道府県に共有されることに同意する",null,null,null,null,null,null,null,null,null,null,null,null,null,"はい",null,"補助対象ではない債権譲渡先に補助金が渡ることを避けるため、国保連が保有している情報を用いて債権譲渡の有無に関して確認を行います。補助金交付過程において、その確認結果を都道府県に共有する必要があります。"]
[]
["国保連合会に登録されている口座情報を本事業の振込に使用することに同意する",null,null,null,null,null,null,null,null,null,null,null,null,null,"はい",null,"同意いただける場合は、「はい」を選択して下さい。"]
["債権譲渡されていない口座情報をご記載ください"]
["金融機関名",null,null,null,null,null,null,null,null,null,"金融機関\nコード",null,null,null,null,null,null,"支店名",null,null,null,null,null,null,"支店コード"]
[]
["預金種類\n1：普通　2：当座　4：貯蓄",null,null,null,null,null,null,null,null,null,null,null,null,"口座番号（左詰め）"]
[]
["（フリガナ）"]
["取引口座名"]
[]
[]
["※なお、本事業実施のために新たに入手・共有された情報は本事業のみに用い、その他の目的で使用されることはありません。"]
[]
["新型コロナウイルス感染症を疑う患者受入れのための救急・周産期・小児医療体制確保事業との重複について"]
[]
["「新型コロナウイルス感染症を疑う患者受入れのための救急・周産期・小児医療体制確保事業」の支援金の申請をしておらず、申請する予定もない",null,null,null,null,null,null,null,null,null,null,null,null,null,null,null,null,null,null,null,"はい",null,"該当する場合は、「はい」を選択して下さい。\n※本事業と左記事業の補助は、重複して受けられませんので、\n　ご留意ください。"]
[]
["事業費用",null,"事業費用"]
[]
[null,"【新型コロナウイルス感染症に対応した感染拡大防止対策や診療体制確保等に要する費用】"]
[]
[null,"対象期間（令和２年４月１日から令和３年３月31日）に、支出が予定されている各科目の費用について概算額を、ご記載ください。\n感染拡大防止対策に要する費用に限られず、院内等での感染拡大を防ぎながら地域で求められる医療を提供するための診療体制確保等に要する費用についても、幅広く補助の対象となります。\n※ 令和2年4月1日から令和3年3月31日までにかかる費用が対象となりますので、支出済みの費用だけでなく、申請日以降に発生が見込まれる費用も合わせて、概算額で申請することも可能です。概算額で申請した場合、事後に実績報告が必要となるため、領収書等の証拠書類を保管しておいてください（実績報告の際に領収書等の証拠書類が必要となります）。なお、実績報告において対象とならない経費が含まれていた場合など、概算で交付した額が交付すべき確定額を上回るときは、その上回る額を返還していただくこととなります。"]
[]
[null,null,null,null,"科目",null,null,null,null,null,null,null,null,null,null,null,null,"支出予定額（円）",null,null,null,"収入予定額（円）"]
[null,null,null,null,"支出",null,"賃金・報酬",null,null,null,null,null,null,null,null,null,null,2000000]
[null,null,null,null,null,null,"謝金",null,null,null,null,null,null,null,null,null,null,400000]
[null,null,null,null,null,null,"会議費",null,null,null,null,null,null,null,null,null,null,500000]
[null,null,null,null,null,null,"旅費",null,null,null,null,null,null,null,null,null,null,135500]
[null,null,null,null,null,null,"需用費",null,null,null,null,null,null,null,null,null,null,4500000]
[null,null,null,null,null,null,"役務費",null,null,null,null,null,null,null,null,null,null,1500000]
[null,null,null,null,null,null,"委託料",null,null,null,null,null,null,null,null,null,null,1500000]
[null,null,null,null,null,null,"使用料及び賃借料",null,null,null,null,null,null,null,null,null,null,3000000]
[null,null,null,null,null,null,"備品購入費",null,null,null,null,null,null,null,null,null,null,4000000]
[null,null,null,null,null,null,"b_合計支出予定額（総事業費）",null,null,null,null,null,null,null,null,null,null,{"$f":"SUM(R57:U65)","v":17535500}]
[null,null,null,null,"収入",null,"ｃ_上記支出に対する本補助金以外の寄付金・その他の収入",null,null,null,null,null,null,null,null,null,null,null,null,null,null,0]
[null,null,null,null,"d_合計支出予定額-収入予定額（円）（ｂ-ｃ）",null,null,null,null,null,null,null,null,null,null,null,null,{"$f":"R66-+V67","v":17535500}]
[null,null,null,null,"補助金交付申請額（円）（aとdのいずれか少ない額)\n（1000円未満切捨）",null,null,null,null,null,null,null,null,null,null,null,null,{"$f":"ROUNDDOWN(IF(Y23<R68,Y23,R68),-3)","v":17000000}]
[]
[null,null,"上記、「賃金・報酬」に従前から勤務している者及び通常の医療の提供を行う者に係る人件費は含まれていない",null,null,null,null,null,null,null,null,null,null,null,null,null,"はい",null,"従前から勤務している者及び通常の医療の提供を行う者に係る人件費は、本事業の対象外ですので、ご確認ください。"]
[]
[null,"　対象期間に支出が予定されている各科目の費用について、概算でご記載ください。\n　各医療機関等からの申請は1回限りですので、対象となる可能性のある費用について、\n漏れのないようご留意ください。"]

{"sheet":"交付申請書","index":1,"n_rows":25,"n_cols":9,"rows_kept":25,"cut":false,"hidden":false,"merged":[[16,0,17,8],[24,0,24,8],[3,7,3,8],[22,3,22,6]]}
["様式1"]
[]
[]
[null,null,null,null,null,null,null,{"$f":"IF(事業実施計画書!D6=0,\"申請日（自動表示）\",事業実施計画書!D6)","v":"申請日（自動表示）"}]
[]
[]
[{"$f":"IF(事業実施計画書!L21=\"\",\"知事名（自動表示）　殿\",事業実施計画書!L21&\"知事　殿\")","v":"知事名（自動表示）　殿"}]
[]
[]
[null,null,null,null,null,null,null,null,{"$f":"事業実施計画書!L21&事業実施計画書!P21","v":""}]
[null,null,null,null,null,null,null,null,{"$f":"事業実施計画書!Q11","v":"医療機関コード、１０桁を入力すると、自動表示されます。"}]
[null,null,null,null,null,null,null,null,{"$f":"事業実施計画書!D14&\"　\"&事業実施計画書!M14","v":"　"}]
[]
[]
[]
[]
["令和２年度新型コロナウイルス感染症緊急包括支援交付金（医療機関・薬局等における感染拡大防止等支援事業）の交付申請書"]
[]
[]
["　標記について、次により交付金を交付されるよう関係書類を添えて申請する。"]
[]
[]
["１　申　請　額",null,null,{"$f":"IF(事業実施計画書!R70=0,\"金（申請額 自動表示）円\",事業実施計画書!R70)","v":"金（申請額 自動表示）円"}]
[]
["２　新型コロナウイルス感染症緊急包括支援交付金（医療機関・薬局等における感染拡大防止等支援事業）に関する事業実施計画書"]

{"sheet":"事業実施計画書","index":2,"n_rows":111,"n_cols":28,"rows_kept":111,"cut":false,"hidden":false,"merged":[[19,3,19,10],[69,17,69,24],[0,27,0,29],[41,7,42,29],[38,24,39,24],[38,25,39,25],[38,26,39,26],[38,27,39,27],[38,28,39,28],[38,0,39,6],[38,7,39,12],[38,13,39,21],[38,22,39,22],[38,23,39,23],[2,15,2,29],[27,0,27,29],[29,0,29,11],[33,16,33,29],[29,14,29,29],[36,29,37,29],[38,29,39,29],[13,12,14,17],[13,3,14,8],[19,11,19,14],[20,11,20,14],[68,4,68,16],[73,1,73,28],[5,0,5,2],[5,3,5,6],[44,0,44,29],[31,14,31,15],[31,0,31,13],[31,16,31,29],[19,15,19,26],[20,15,20,26],[16,0,17,2],[16,3,16,7],[16,8,16,12],[16,13,16,17],[13,0,14,2],[13,9,14,11],[29,12,29,13],[48,0,48,19],[48,22,48,29],[56,21,56,24],[56,4,56,16],[56,17,56,20],[33,14,33,15],[33,0,33,13],[67,4,67,5],[63,17,63,20],[64,17,64,20],[57,21,66,24],[65,17,65,20],[67,17,67,20],[57,6,57,16],[58,6,58,16],[59,6,59,16],[66,17,66,20],[50,2,50,25],[54,1,54,28],[36,3,37,9],[36,10,37,12],[36,20,37,23],[36,24,37,26],[36,27,37,27],[36,28,37,28],[36,13,37,13],[69,4,69,16],[57,4,66,5],[66,6,66,16],[19,0,20,2],[25,14,25,29],[22,12,22,14],[22,15,22,18],[22,19,22,23],[22,0,22,5],[22,6,22,11],[25,0,25,11],[25,12,25,13],[23,6,23,11],[22,24,22,29],[36,14,37,14],[36,15,37,15],[36,16,37,16],[36,17,37,19],[40,0,40,6],[40,7,40,29],[41,0,42,6],[68,17,68,24],[35,0,35,10],[36,0,37,2],[16,18,16,29],[17,3,17,7],[17,8,17,12],[17,13,17,17],[17,18,17,29],[71,2,71,15],[71,16,71,17],[71,18,71,27],[48,20,48,21],[46,0,46,29],[67,21,67,24],[64,6,64,16],[61,6,61,16],[62,6,62,16],[65,6,65,16],[63,6,63,16],[60,6,60,16],[67,6,67,16],[61,17,61,20],[62,17,62,20],[57,17,57,20],[58,17,58,20],[59,17,59,20],[60,17,60,20],[3,0,3,29],[7,0,7,29],[10,0,11,2],[10,3,11,3],[10,4,11,4],[10,5,11,5],[10,10,11,10],[10,11,11,11],[10,12,11,12],[10,13,11,15],[10,16,11,29],[5,7,5,15],[10,6,11,6],[10,7,11,7],[10,8,11,8],[10,9,11,9]]}
[null,null,null,null,null,null,null,null,null,null,null,null,null,null,null,null,null,null,null,null,null,null,null,null,null,null,null,{"$f":"VLOOKUP(MID(CELL(\"filename\"),FIND(\"[\",CELL(\"filename\"))+1,2),リスト!B:C,2,0)","v":{"$error":"#N/A"}}]
[]
["様式2-1 （「様式2-2」は、紙申請用であり、どちらか一方を提出）",null,null,null,null,null,null,null,null,null,null,null,null,null,null,"オンライン請求システム・WEB受付申請システム・電子媒体(CD-R）申請用"]
["事業実施計画書_医療機関・薬局等における感染拡大防止等支援事業"]
[]
["申請日",null,null,null,null,null,null,"（入力形式）　西暦４桁 / 月 / 日　　半角、スラッシュ区切り\n（表示は、元号表示になります）"]
[]
["施設概要"]
[]
[null,null,"助産所コードを有さない助産所は「9999999999」を入力してください"]
["医療機関等\nコード（10桁）",null,null,null,null,null,null,null,null,null,null,null,null,"施設名称",null,null,{"$f":"IF(D11&E11&F11&G11&H11&I11&J11&K11&L11&M11=\"\",\"医療機関コード、１０桁を入力すると、自動表示されます。\",\nIFERROR(VLOOKUP(D11&E11&F11&G11&H11&I11&J11&K11&L11&M11,医療機関コードマスタ!A:Z,2,0),\"自動表示されない場合は、番号をご確認下さい。　それでも\"&CHAR(10)&\"自動表示されない（または変更がある）場合は、手入力してください。\"))","v":"医療機関コード、１０桁を入力すると、自動表示されます。"}]
[]
[]
["管理者職名",null,null,null,null,null,null,null,null,"管理者氏名"]
[]
[]
["連絡先",null,null,"担当部署",null,null,null,null,"担当者氏名",null,null,null,null,"連絡先電話番号",null,null,null,null,"連絡先メールアドレス"]
[]
[]
["所在地",null,null,"郵便番号",null,null,null,null,null,null,null,"都道府県",null,null,null,"市区町村以降"]
[null,null,null,{"$f":"IFERROR(MID(VLOOKUP(D11&E11&F11&G11&H11&I11&J11&K11&L11&M11,医療機関コードマスタ!A:Z,3,0),1,1),\"\")","v":""},{"$f":"IFERROR(MID(VLOOKUP(D11&E11&F11&G11&H11&I11&J11&K11&L11&M11,医療機関コードマスタ!A:Z,3,0),2,1),\"\")","v":""},{"$f":"IFERROR(MID(VLOOKUP(D11&E11&F11&G11&H11&I11&J11&K11&L11&M11,医療機関コードマスタ!A:Z,3,0),3,1),\"\")","v":""},"-",{"$f":"IFERROR(MID(VLOOKUP(D11&E11&F11&G11&H11&I11&J11&K11&L11&M11,医療機関コードマスタ!A:Z,3,0),4,1),\"\")","v":""},{"$f":"IFERROR(MID(VLOOKUP(D11&E11&F11&G11&H11&I11&J11&K11&L11&M11,医療機関コードマスタ!A:Z,3,0),5,1),\"\")","v":""},{"$f":"IFERROR(MID(VLOOKUP(D11&E11&F11&G11&H11&I11&J11&K11&L11&M11,医療機関コードマスタ!A:Z,3,0),6,1),\"\")","v":""},{"$f":"IFERROR(MID(VLOOKUP(D11&E11&F11&G11&H11&I11&J11&K11&L11&M11,医療機関コードマスタ!A:Z,3,0),7,1),\"\")","v":""},{"$f":"IFERROR(VLOOKUP((D11&E11),リスト!B2:C48,2,0),\"\")","v":""},null,null,null,{"$f":"IFERROR(VLOOKUP(D11&E11&F11&G11&H11&I11&J11&K11&L11&M11,医療機関コードマスタ!A:Z,4,0),\"\")","v":""}]
[]
["施設類型（プルダウンから選択）",null,null,null,null,null,null,null,null,null,null,null,"許可病床数※\n（病院のみ記載）",null,null,null,null,null,null,"a_補助上限額（基準額）\n（円）",null,null,null,null,{"$f":"IF(COUNTIF(G23,\"病院*\")=1,200+5*P23,IF(OR(G23=\"有床診療所（医科）\",G23=\"有床診療所（歯科）\"),200,IF(OR(G23=\"無床診療所（医科）\",G23=\"無床診療所（歯科）\"),100,IF(OR(G23=\"薬局\",G23=\"訪問看護ステーション\",G23=\"助産所\"),70,\"０\"))))*10000","v":0}]
[null,null,null,null,null,null,{"$f":"IF(AND(OR(G23=\"病院（医科）\",G23=\"病院（歯科）\"),P23<20),\"病床数を入力して下さい。\",\"\")","v":""},null,null,null,null,null,"※ 原則として令和２年4月1日現在の医療法上の許可病床数"]
[]
["施設類型及び許可病床数に間違いがない",null,null,null,null,null,null,null,null,null,null,null,null,null,"施設類型及び許可病床数に間違いがない場合は、左の欄で「はい」を選択して下さい。\n※間違いがあり本来の補助金額を超過して補助金が支払われた場合、超過分は返還対象となります。"]
[]
["口座情報"]
[]
["国保連合会に登録されている口座は債権譲渡されていない\n（助産所コードを有さない助産所は、「いいえ」を選択してください）",null,null,null,null,null,null,null,null,null,null,null,null,null,"債権譲渡されていない場合は、「はい」を選択して下さい。債権譲渡されている場合は、国保連に登録されている口座への補助金の振込ができませんので、債権譲渡されていない口座の情報を提出していただく必要があります。"]
[]
["国保連合会による当該口座の債権譲渡に関する確認結果が都道府県に共有されることに同意する",null,null,null,null,null,null,null,null,null,null,null,null,null,null,null,"補助対象ではない債権譲渡先に補助金が渡ることを避けるため、国保連が保有している情報を用いて債権譲渡の有無に関して確認を行います。補助金交付過程において、その確認結果を都道府県に共有する必要があります。"]
[]
["国保連合会に登録されている口座情報を本事業の振込に使用することに同意する",null,null,null,null,null,null,null,null,null,null,null,null,null,null,null,"同意いただける場合は、「はい」を選択して下さい。"]
[]
["債権譲渡されていない口座情報をご記載ください"]
["金融機関名",null,null,null,null,null,null,null,null,null,"金融機関\nコード",null,null,null,null,null,null,"支店名",null,null,null,null,null,null,"支店コード"]
[]
["預金種類\n1：普通　2：当座　4：貯蓄",null,null,null,null,null,null,null,null,null,null,null,null,"口座番号（左詰め）"]
[]
["（フリガナ）"]
["取引口座名"]
[]
[]
["※なお、本事業実施のために新たに入手・共有された情報は本事業のみに用い、その他の目的で使用されることはありません。"]
[]
["新型コロナウイルス感染症を疑う患者受入れのための救急・周産期・小児医療体制確保事業との重複について"]
[]
["「新型コロナウイルス感染症を疑う患者受入れのための救急・周産期・小児医療体制確保事業」の支援金の申請をしておらず、申請する予定もない",null,null,null,null,null,null,null,null,null,null,null,null,null,null,null,null,null,null,null,null,null,"該当する場合は、「はい」を選択して下さい。\n※本事業と左記事業の補助は、重複して受けられませんので、\n　ご留意ください。"]
[]
[null,null,"事業費用"]
[]
[null,"【新型コロナウイルス感染症に対応した感染拡大防止対策や診療体制確保等に要する費用】"]
[]
[null,"対象期間（令和２年４月１日から令和３年３月31日）に、支出が予定されている各科目の費用について概算額を、ご記載ください。\n感染拡大防止対策に要する費用に限られず、院内等での感染拡大を防ぎながら地域で求められる医療を提供するための診療体制確保等に要する費用についても、幅広く補助の対象となります。\n※ 令和2年4月1日から令和3年3月31日までにかかる費用が対象となりますので、支出済みの費用だけでなく、申請日以降に発生が見込まれる費用も合わせて、概算額で申請することも可能です。概算額で申請した場合、事後に実績報告が必要となるため、領収書等の証拠書類を保管しておいてください（実績報告の際に領収書等の証拠書類が必要となります）。なお、実績報告において対象とならない経費が含まれていた場合など、概算で交付した額が交付すべき確定額を上回るときは、その上回る額を返還していただくこととなります。"]
[]
[null,null,null,null,"科目",null,null,null,null,null,null,null,null,null,null,null,null,"支出予定額（円）",null,null,null,"収入予定額（円）"]
[null,null,null,null,"支出",null,"賃金・報酬"]
[null,null,null,null,null,null,"謝金"]
[null,null,null,null,null,null,"会議費"]
[null,null,null,null,null,null,"旅費"]
[null,null,null,null,null,null,"需用費"]
[null,null,null,null,null,null,"役務費"]
[null,null,null,null,null,null,"委託料"]
[null,null,null,null,null,null,"使用料及び賃借料"]
[null,null,null,null,null,null,"備品購入費"]
[null,null,null,null,null,null,"b_合計支出予定額（総事業費）",null,null,null,null,null,null,null,null,null,null,{"$f":"SUM(R58:U66)","v":0}]
[null,null,null,null,"収入",null,"ｃ_上記支出に対する本補助金以外の寄付金・その他の収入"]
[null,null,null,null,"d_合計支出予定額-収入予定額（円）（ｂ-ｃ）",null,null,null,null,null,null,null,null,null,null,null,null,{"$f":"R67-V68","v":0}]
[null,null,null,null,"補助金交付申請額（円）（aとdのいずれか少ない額)\n（1000円未満切捨）",null,null,null,null,null,null,null,null,null,null,null,null,{"$f":"ROUNDDOWN(IF(Y23<R69,Y23,R69),-3)","v":0}]
[]
[null,null,"上記、「賃金・報酬」に従前から勤務している者及び通常の医療の提供を行う者に係る人件費は含まれていない",null,null,null,null,null,null,null,null,null,null,null,null,null,null,null,"従前から勤務している者及び通常の医療の提供を行う者に係る人件費は、本事業の対象外ですので、ご確認ください。"]
[]
[null,"　対象期間に支出が予定されている各科目の費用について、概算でご記載ください。\n　各医療機関等からの申請は1回限りですので、対象となる可能性のある費用について、\n漏れのないようご留意ください。"]
[]
[]
[]
[]
[]
[]
[]
[]
[]
[]
[]
[]
[]
[]
[]
[]
[]
[]
[]
[]
[]
[]
[]
[]
[]
[]
[]
[]
[]
[]
[]
[]
[]
[]
["　　　　　　　ファイル　出力中"]
[]
["　　 　　　　　　　　　　しばらく、お待ちください"]

{"sheet":"申請概要","index":3,"n_rows":5,"n_cols":17,"rows_kept":5,"cut":false,"hidden":false,"merged":[[0,0,0,16],[0,22,0,28],[1,0,1,16],[3,1,3,10]]}
["様式3"]
["申請概要_医療機関・薬局等における感染拡大防止等支援事業"]
[]
["施設名称","医療機関等コード",null,null,null,null,null,null,null,null,null,"郵便番号","所在地","電話番号","補助金交付申請額(円)","【都道府県記載欄】\n補助金概算交付額(円)","事業計画書における\n国保連取扱\n不可事由"]
[{"$f":"IF(事業実施計画書!Q11=\"医療機関コード、１０桁を入力すると、自動表示されます。\",\"\",事業実施計画書!Q11)","v":""},{"$f":"IF(事業実施計画書!D11=\"\",\"\",事業実施計画書!D11)","v":""},{"$f":"IF(事業実施計画書!E11=\"\",\"\",事業実施計画書!E11)","v":""},{"$f":"IF(事業実施計画書!F11=\"\",\"\",事業実施計画書!F11)","v":""},{"$f":"IF(事業実施計画書!G11=\"\",\"\",事業実施計画書!G11)","v":""},{"$f":"IF(事業実施計画書!H11=\"\",\"\",事業実施計画書!H11)","v":""},{"$f":"IF(事業実施計画書!I11=\"\",\"\",事業実施計画書!I11)","v":""},{"$f":"IF(事業実施計画書!J11=\"\",\"\",事業実施計画書!J11)","v":""},{"$f":"IF(事業実施計画書!K11=\"\",\"\",事業実施計画書!K11)","v":""},{"$f":"IF(事業実施計画書!L11=\"\",\"\",事業実施計画書!L11)","v":""},{"$f":"IF(事業実施計画書!M11=\"\",\"\",事業実施計画書!M11)","v":""},{"$f":"事業実施計画書!D21&事業実施計画書!E21&事業実施計画書!F21&事業実施計画書!G21&事業実施計画書!H21&事業実施計画書!I21&事業実施計画書!J21&事業実施計画書!K21","v":"-"},{"$f":"事業実施計画書!L21&事業実施計画書!P21","v":""},{"$f":"IF(事業実施計画書!N18=\"\",\"\",事業実施計画書!N18)","v":""},{"$f":"事業実施計画書!R70","v":0},{"$f":"O5","v":0},{"$f":"IF(事業実施計画書!D10=9,\"有\",IF(AND(事業実施計画書!M30=\"はい\",事業実施計画書!O32=\"はい\",事業実施計画書!O34=\"はい\"),\"無\",\"有\"))","v":"有"}]

{"sheet":"リスト","index":4,"n_rows":48,"n_cols":3,"rows_kept":48,"cut":false,"hidden":true,"merged":[]}
[null,"コード","都道府県"]
[null,"01","北海道"]
[null,"02","青森県"]
[null,"03","岩手県"]
[null,"04","宮城県"]
[null,"05","秋田県"]
[null,"06","山形県"]
[null,"07","福島県"]
[null,"08","茨城県"]
[null,"09","栃木県"]
[null,"10","群馬県"]
[null,"11","埼玉県"]
[null,"12","千葉県"]
[null,"13","東京都"]
[null,"14","神奈川県"]
[null,"15","新潟県"]
[null,"16","富山県"]
[null,"17","石川県"]
[null,"18","福井県"]
[null,"19","山梨県"]
[null,"20","長野県"]
[null,"21","岐阜県"]
[null,"22","静岡県"]
[null,"23","愛知県"]
[null,"24","三重県"]
[null,"25","滋賀県"]
[null,"26","京都府"]
[null,"27","大阪府"]
[null,"28","兵庫県"]
[null,"29","奈良県"]
[null,"30","和歌山県"]
[null,"31","鳥取県"]
[null,"32","島根県"]
[null,"33","岡山県"]
[null,"34","広島県"]
[null,"35","山口県"]
[null,"36","徳島県"]
[null,"37","香川県"]
[null,"38","愛媛県"]
[null,"39","高知県"]
[null,"40","福岡県"]
[null,"41","佐賀県"]
[null,"42","長崎県"]
[null,"43","熊本県"]
[null,"44","大分県"]
[null,"45","宮崎県"]
[null,"46","鹿児島県"]
[null,"47","沖縄県"]

{"sheet":"医療機関コードマスタ","index":5,"n_rows":2249,"n_cols":4,"rows_kept":2249,"cut":false,"hidden":true,"merged":[]}
["医療機関\nコード","事業所名","郵便番号","住所"]
["4710110521","宮城胃腸科内科医院","9020064","那覇市寄宮２－３７－１２"]
["4710111107","一般社団法人　那覇市医師会　生活習慣病検診センター","9000034","那覇市東町２６－１"]
["4710111636","日賀耳鼻咽喉科","9000016","那覇市前島１－１５－１"]
["4710111644","吉本内科小児科医院","9020062","那覇市松川１－１５－６"]
["4710111917","岸本外科医院","9020062","那覇市松川４０３"]
["4710112014","社会医療法人　葦の会　オリブ山病院","9030804","那覇市首里石嶺町４－３５６"]
["4710112634","医療法人　はごろも会　仲本病院","9020061","那覇市古島１－２２－１"]
["4710112659","開南皮フ科","9000014","那覇市松尾２丁目２４－１４（高良ビル２階）"]
["4710112758","長嶺胃腸科内科外科医院","9010153","那覇市宇栄原１０１９－１宇栄原センターハイツ２階"]
["4710112808","松島内科クリニック","9000014","那覇市松尾１－４－１１"]
["4710112923","石川産婦人科","9000021","那覇市泉崎２－２０－２"]
["4710112956","高良内科医院","9000023","那覇市楚辺２－２５－１１"]
["4710113004","沖映通り眼科","9000013","那覇市牧志１－４－４３（新川ビル２階）"]
["4710113152","嘉数胃腸科外科医院","9020074","那覇市仲井真３７９－２"]
["4710113210","大城眼科医院","9030804","那覇市首里石嶺町４－９６"]
["4710113251","琉生病院","9020066","那覇市大道５６番地"]
["4710113269","前浜小児科医院","9020062","那覇市松川２－５－３０"]
["4710113392","幸地診療所","9030825","那覇市首里山川町１－７３"]
["4710113434","新垣クリニック","9000012","那覇市泊１－１３－１"]
["4710113467","耳鼻咽喉科小禄クリニック","9010153","那覇市宇栄原１－６－３３"]
["4710113632","医療法人　新田クリニック","9000016","那覇市前島１－１４－３"]
["4710113673","新川クリニック","9020065","那覇市壺屋１－２－１６"]
["4710113707","福の木診療所","9030821","那覇市首里儀保町２－３９"]
["4710113715","石川外科クリニック","9000013","那覇市牧志３－９－１８"]
["4710113749","順天堂クリニック","9000012","那覇市泊１－１３－１"]
["4710113780","天久台病院","9000005","那覇市天久１１２３"]
["4710113798","古謝内科医院","9000021","那覇市泉崎２－７－２"]
["4710113822","神谷医院","9020077","那覇市長田１－１２－３５"]
["4710113855","ペリー内科小児科医院","9000027","那覇市山下町３０番１０号"]
["4710113871","伊集内科医院","9000033","那覇市久米２－１０－１５"]
["4710113897","沖縄回生クリニック","9020066","那覇市大道１１５－６"]
["4710113913","おおしろ小児科医院","9020073","那覇市上間３７０－１"]
["4710113947","西町クリニック","9000036","那覇市西３－４－１"]
["4710114036","西武門病院","9000034","那覇市東町５番２２号"]
["4710114044","医療法人　禄寿会　小禄病院","9010152","那覇市小禄５４７－１"]
["4710114101","医療法人　明峰会　真玉橋クリニック","9020078","那覇市識名１３１６－３"]
["4710114119","赤嶺耳鼻咽喉科","9010145","那覇市高良３－６－８"]
["4710114143","三原内科クリニック","9020063","那覇市三原２－３０－５"]
["4710114317","高里内科胃腸科","9020064","那覇市寄宮１－９－２４"]
["4710114499","平良クリニック","9000014","那覇市松尾２－１６－４３"]
["4710114515","医療法人寿仁会　沖縄セントラル病院","9020076","那覇市与儀１－２６－６"]
["4710114523","首里協同クリニック","9030804","那覇市首里石嶺町１－１４７－３"]
["4710114531","ウイメンズクリニック糸数","9000012","那覇市泊１－２９－１２"]
["4710114572","山城整形外科眼科医院","9000022","那覇市樋川１－１８－２２"]
["4710114580","菜の花クリニック","9000021","那覇市泉崎１－１６－１６比嘉ビル１Ｆ"]
["4710114630","なはまちクリニック","9000014","那覇市松尾２－１９－３９グリーハイツ那覇２０９号"]
["4710114648","医療法人　育伸会　垣花小児科内科医院","9010155","那覇市金城５－１４－１２"]
["4710114671","いけま小児クリニック","9020068","那覇市真嘉比２丁目１番５号"]
["4710114689","小禄整形外科","9010155","那覇市金城５－２－８"]
["4710114713","たばる内科胃腸科","9010155","那覇市金城５－３－１"]
["4710114762","医療法人厚仁会　与儀中央クリニック","9020076","那覇市与儀３６６－２"]
["4710114788","石川眼科医院","9000021","那覇市泉崎２－３－２０"]
["4710114804","あさひ眼科","9020077","那覇市長田１－１－１アクロス寄宮１０１号"]
["4710114846","医療法人　八重洲クリニック","9000032","那覇市松山２－２３－１３"]
["4710114879","守礼クリニック","9010156","那覇市田原３－３－７"]
["4710115017","安謝小児クリニック","9000003","那覇市安謝２１５－１"]
["4710115025","島袋内科胃腸科","9030805","那覇市首里鳥堀町４－７"]
["4710115033","山城消化器内科医院","9000022","那覇市樋川１－１８－２２"]
["4710115058","鳥掘養生クリニック","9030812","那覇市首里当蔵町３－２１－２"]
["4710115108","古謝泌尿器科クリニック","9020075","那覇市国場３７２"]
["4710115124","開邦クリニック","9000024","那覇市古波蔵２－４－１４"]
["4710115132","花城内科医院","9030821","那覇市首里儀保町３－８"]
["4710115173","にこにこ整形外科医院","9000025","那覇市壺川２－１１－２"]
["4710115181","伊波レディースクリニック","9030806","那覇市首里汀良町１－８－２"]
["4710115207","かなしろ内科","9000024","那覇市古波蔵１丁目１番６号"]
["4710115215","医療法人　沖縄徳洲会　こくらクリニック","9000024","那覇市古波蔵３－８－２８"]
["4710115249","川平病院","9000024","那覇市古波蔵３－５－２５"]
["4710115256","医療法人学豊会　安里皮膚科医院","9020065","那覇市壺屋２－４－３"]
["4710115272","大田整形外科医院","9010152","那覇市小禄１－１－５０"]
["4710115298","医療法人　陽心会　大道中央病院","9020067","那覇市安里１丁目１番３７号"]
["4710115306","中央皮フ科","9000014","那覇市松尾１－４－１３"]
["4710115348","かなでクリニック","9000015","那覇市久茂地２丁目６－２０第一久高木材ビル２Ｆ　　"]
["4710115371","友利産婦人科","9000024","那覇市古波蔵２－２５－３４"]
["4710115389","いらはクリニック","9010156","那覇市田原１－９－２"]
["4710115397","曙クリニック","9000002","那覇市曙３－２０－１４"]
["4710115488","那覇リハビリクリニック","9030811","那覇市首里赤平町２－１３－２　赤平市街地分譲住宅１階"]
["4710115496","田崎病院","9020062","那覇市松川３１９"]
["4710115520","あじとみクリニック","9010145","那覇市高良１－１０－７コーポナガミネ１０１"]
["4710115546","おろく皮フ科クリニック","9010152","那覇市小禄五丁目１３番地１たかよしビル１階"]
["4710115579","那覇西クリニック","9010154","那覇市赤嶺２－１－９"]
["4710115587","仲本内科","9000004","那覇市銘苅３－１５－３"]
["4710115595","整形外科　てるクリニック","9000005","那覇市天久２－５－３８"]
["4710115629","白井クリニック","9020072","那覇市真地５２－３"]
["4710115645","医療法人　城南会　小禄みなみ診療所","9010147","那覇市宮城１－１－３７"]
["4710115678","長田クリニック","9020075","那覇市国場３３４－１"]
["4710115694","まきし眼科クリニック","9000004","那覇市銘苅２－４－１８－１０２"]
["4710115728","平田胃腸科・内科","9000004","那覇市銘苅３－２２－３３Ｒ－８ビル１Ｆ"]
["4710115819","がなは医院","9020063","那覇市三原１丁目２８番１２号"]
["4710115827","仲里眼科","9010156","那覇市田原１－９－１"]
["4710115843","かず整形外科クリニック","9020071","那覇市繁多川３－７－８"]
["4710115868","天久のクリニック","9000005","那覇市天久１－２７－２０"]
["4710115876","仲本クリニック","9000006","那覇市おもろまち４－１１－２４"]
["4710115918","こくら台ハートクリニック","9020075","那覇市国場１１６９－２０"]
["4710115926","やぎＳＵＮクリニック","9020074","那覇市仲井真３１７－１　２Ｆ"]
["4710115934","ふくろうクリニック","9000013","那覇市牧志２－１６－１２"]
["4710115942","つぼや眼科","9020065","那覇市壺屋１－７－１６"]
["4710115975","けいわクリニック","9000013","那覇市牧志２－１７－１２　いとみね会館１階"]
["4710116015","美代子クリニック","9020061","那覇市古島１－２２－１０"]
["4710116031","アラカキ眼科","9020068","那覇市真嘉比三丁目１３番３号"]
["4710116064","医療法人　真仁会　真栄城耳鼻咽喉科","9020067","那覇市安里１－６－６"]
["4710116072","てるきな内科胃腸科医院","9010152","那覇市小禄５－１４－５"]
["4710116080","医療法人　セントペアレント石間","9010155","那覇市金城２－１－５"]
["4710116155","首里城下町クリニック第一","9020062","那覇市松川３－１８－３０"]
["4710116163","茶園耳鼻科","9010152","那覇市小禄２丁目３－１７"]
["4710116197","がきやクリニック","9020077","那覇市長田２－２５－１４"]
["4710116254","おおみじゃ眼科","9020071","那覇市繁多川３－７－８"]
["4710116270","小児クリニックたまなは","9000005","那覇市天久１－６－１９"]
["4710116304","浦崎整形外科クリニック","9020065","那覇市壺屋２－１４－２４"]
["4710116312","喜屋武内科・呼吸器科","9000004","那覇市銘苅２－１１－２２"]
["4710116361","協同にじクリニック","9000024","那覇市古波蔵４丁目１０番１０号"]
["4710116403","町田医院","9020062","那覇市松川２９９－７"]
["4710116411","ぐしけん皮フ科","9000004","那覇市銘苅３－２２－３３Ｒ－８ビル２Ｆ"]
["4710116437","前田胃腸科医院","9020063","那覇市三原２－１５－１２"]
["4710116452","首里整形外科","9030804","那覇市首里石嶺町１－１６１－１"]
["4710116478","なかそね和内科","9020062","那覇市松川４７番地"]
["4710116510","ハートセラピークリニック","9000015","那覇市久茂地３－２９－２８　久茂地天使館２階"]
["4710116528","かおる小児科","9020075","那覇市国場７２４－３　メゾンセブン１０１号"]
["4710116536","那覇西クリニック　まかび","9020068","那覇市真嘉比２丁目２９番２２号"]
["4710116569","叶クリニック","9030804","那覇市首里石嶺町４－９－１"]
{"$rows_left_out":2129}